{"text_format":"1","workbook":"xlsx","n_sheets":10,"sheets":["Menu","menu_exp","mascara","calculo","seg aut","masc_termino","termin_exp","masc_exp2","exp2","config"],"not_rendered":{"charts":0,"images":3,"macros":1,"external_links":0,"defined_names":1,"comments":0,"pivot_tables":0},"unopened":[],"bounds":{"document_bytes":16777216,"sheet_cells":100000,"rows_first":2000,"rows_last":500,"rows_between":2000,"halvings":0,"cell_chars":16384,"cell_head_chars":4096},"cells_cut":0,"cells_raw":0,"read":"whole","date_system":"1900"}

{"sheet":"Menu","index":0,"n_rows":31,"n_cols":1,"rows_kept":31,"cut":false,"hidden":false,"merged":[[30,0,30,25],[0,15,0,255],[0,0,0,9],[8,0,8,16383]]}
[]
[]
[]
[]
[]
[]
[]
[]
["Base de cálculos trabalhistas - Comércio do estado de São Paulo"]
[]
{"$rows_left_out":22}
{"sheet":"menu_exp","index":1,"n_rows":25,"n_cols":1,"rows_kept":25,"cut":false,"hidden":false,"merged":[[0,0,0,9],[0,15,0,255],[8,0,8,16383],[23,0,23,25]]}
[]
[]
[]
[]
[]
[]
[]
[]
["Cálculo de rescisão de contrato de experiência"]
[]
{"$rows_left_out":16}
{"sheet":"mascara","index":2,"n_rows":41,"n_cols":24,"rows_kept":41,"cut":false,"hidden":false,"merged":[[12,0,12,20],[13,1,13,6],[11,1,11,6],[11,7,11,9],[0,13,1,19],[2,13,2,19],[4,0,4,20],[5,7,5,14],[10,0,10,20],[5,1,5,6],[7,1,7,6],[9,7,9,9],[7,7,7,9],[6,0,6,20],[11,13,11,18],[13,7,13,10],[31,1,31,19],[32,1,32,19],[15,10,15,17],[27,4,27,15],[25,1,25,3],[19,14,19,16],[19,4,19,6],[19,11,19,12],[19,1,19,3],[13,16,13,19],[40,0,40,20],[34,8,34,9],[15,7,15,9],[30,10,30,11],[27,1,27,3],[21,1,21,8],[21,9,21,11],[16,1,16,19],[25,4,25,15],[34,1,34,7],[35,0,35,20],[17,1,17,19],[30,1,30,9],[14,0,14,20],[15,1,15,6]]}
[null,null,null,null,null,null,null,null,null,null,null,null,null,"Base de cálculo demissional",null,null,null,null,null,null,null,null,"sim ou não","afastamento"]
[null,null,null,null,null,null,null,null,null,null,null,null,null,null,null,null,null,null,null,null,null,null,"sim","Dispensa sem justa causa"]
[null,null,null,null,null,null,null,null,null,null,null,null,null,{"$f":"config!I101","v":"FECOMERCIÁRIOS"},null,null,null,null,null,null,null,null,"não","Pedido de demissão"]
[]
[]
[null,"Motivo do Afastamento:",null,null,null,null,null,null,null,null,null,null,null,null,null,null,{"$f":"IF(H6=\"Pedido de demissão\",IF(H10>0,IF(H12>0,\"Dias de aviso cumprido:\",\"\"),\"\"),\"\")","v":""},null,{"$f":"IF(H6=\"Pedido de demissão\",IF(H10>0,IF(H12>0,H12-H10,\"\"),\"\"),\"\")","v":""}]
[]
[null,"Admissão:",null,null,null,null,null,null,null,null,"dd/mm/aaaa (data do registro na carteira)",null,null,null,null,null,null,null,null,{"$f":"IF(H6=\"\",0,H12-H10)","v":0}]
[]
[null,null,null,null,null,null,"Data do aviso:",null,null,null,"dd/mm/aaaa",null,null,{"$f":"IF(P10=\"\",\"\",IF(H6=\"Dispensa sem justa causa\",\"Direito á\",\"\"))","v":""},null,{"$f":"IF(H6=\"Dispensa sem justa causa\",IF(H8>0,IF(H10>0,IF(calculo!AI8+30<=90,calculo!AI8+30,90),\"\"),\"\"),\"\")","v":""},{"$f":"IF(P10=\"\",\"\",IF(H6=\"Dispensa sem justa causa\",\"dias de aviso prévio (trabalhado ou indenizado)\",\"\"))","v":""}]
{"$rows_left_out":32}
{"sheet":"calculo","index":3,"n_rows":61,"n_cols":42,"rows_kept":61,"cut":false,"hidden":false,"merged":[[50,25,50,28],[52,25,52,28],[48,17,48,28],[54,25,54,28],[50,3,50,8],[52,3,52,8],[52,9,52,11],[41,33,42,33],[41,34,42,34],[13,25,13,26],[14,25,14,26],[13,14,13,24],[35,25,35,28],[56,3,58,28],[13,10,13,12],[14,15,14,24],[17,19,17,28],[25,25,25,28],[27,25,27,28],[19,25,19,28],[23,25,23,28],[35,10,35,13],[39,10,39,13],[29,25,29,28],[17,10,17,13],[43,9,43,13],[43,24,43,28],[41,10,41,13],[48,3,48,12],[4,3,4,28],[9,6,9,10],[9,25,9,28],[11,7,11,12],[7,10,7,17],[5,6,5,28],[6,7,6,28],[10,25,10,28],[45,3,46,17],[45,25,45,28],[29,10,29,13],[21,6,21,7],[33,10,33,13],[43,19,43,23],[21,25,21,28],[31,10,31,13],[31,25,31,28],[37,10,37,13],[19,7,19,8],[41,3,41,9],[9,16,9,19],[23,10,23,13],[25,10,25,13],[19,10,19,13],[21,10,21,13],[27,10,27,13]]}
[null,null,null,{"$f":"config!I101","v":"FECOMERCIÁRIOS"},null,null,null,null,null,null,null,null,null,null,null,null,null,null,null,null,null,null,null,null,null,null,null,null,null,null,null,"Único Company    .:.    Acácio Jr     .:.    Fecomerciários"]
[null,null,null,{"$f":"config!I102","v":"Federação dos Empregados no Comércio do Estado de São Paulo"}]
[]
[null,null,null,{"$f":"config!J103","v":"Rua dos Pinheiros, nº 20 - Pinheiros"},null,null,null,null,null,null,null,null,null,null,null,null,null,null,null,null,null,null,null,null,null,null,null,null,{"$f":"config!H104","v":"(11) 3060 6600"},null,null,null,null,"Multa Data Base",{"$f":"IF(K8=\"Dispensa sem justa causa\",IF(Z11<DATE(YEAR(Z11),config!AD103,config!AB103),IF(Z11>=DATE(YEAR(Z11),config!AD103,config!AB103)-30,H12,0),0),0)","v":0}]
[null,null,null,"Base de cálculo demissional",null,null,null,null,null,null,null,null,null,null,null,null,null,null,null,null,null,null,null,null,null,null,null,null,null,null,null,null,null,"Projeção pedido de demissão",{"$f":"Q10+30","v":"1900-01-30"}]
[null,null,null,{"$f":"IF(mascara!E26=\"\",\"\",\"Empresa:\")","v":""},null,null,{"$f":"IF(mascara!E26=\"\",\"\",mascara!E26)","v":""},null,null,null,null,null,null,null,null,null,null,null,null,null,null,null,null,null,null,null,null,null,null,null,null,null,null,"saldo de dias trabalhados",{"$f":"IF(MONTH(Z10)=MONTH(G10),IF(YEAR(Z10)=YEAR(G10),DAY(Z10)-DAY(G10),DAY(Z10)),DAY(Z10))","v":{"$error":"#VALUE!"}},"Total de dias trabalhados",{"$f":"IF(MONTH(Z10)=MONTH(G10),IF(YEAR(Z10)=YEAR(G10),DAY(Z10)-DAY(G10)+1,DAY(Z10)),DAY(Z10))","v":{"$error":"#VALUE!"}},"Fevereiro",{"$f":"IF(MONTH(Z10)=2,AO6,0)","v":{"$error":"#VALUE!"}},{"$f":"Z10+1","v":{"$error":"#VALUE!"}},{"$f":"IF(MONTH(Z10)=MONTH(AN6),0,30)","v":{"$error":"#VALUE!"}}]
[null,null,null,{"$f":"IF(mascara!E28=\"\",\"\",\"Trabalhador:\")","v":""},null,null,null,{"$f":"IF(mascara!E28=\"\",\"\",mascara!E28)","v":""},null,null,null,null,null,null,null,null,null,null,null,null,null,null,null,null,null,null,null,null,null,null,null,null,null,"Data projeção do  aviso",{"$f":"IF(K8=\"Dispensa sem justa causa\",mascara!H10+mascara!P10,Z10)+AM11+AP8","v":{"$error":"#VALUE!"}},{"$f":"IF(K8=\"Dispensa sem justa causa\",Q10+30,Z10)","v":""},{"$f":"AJ7-1","v":{"$error":"#VALUE!"}},{"$f":"IF(AM7<=0,DAY(AJ7)-DAY(G10),0)","v":{"$error":"#VALUE!"}},{"$f":"MONTH(AK7)-MONTH(G10)","v":{"$error":"#VALUE!"}},{"$f":"IF(AM7<0,1,IF(AL7<0,1,0))","v":{"$error":"#VALUE!"}}]
[null,null,null,"Motivo do Afastamento:",null,null,null,null,null,null,{"$f":"mascara!H6","v":0},null,null,null,null,null,null,null,null,null,null,null,null,null,null,null,null,null,null,null,null,null,null,"Anos trabalhados",{"$f":"IF(K8=\"Dispensa sem justa causa\",IF(AK8>=config!L53,60,VLOOKUP(AK8,config!E31:L52,5,FALSE)-30),0)","v":0},{"$f":"IF(YEAR(AJ7)>YEAR(G10),(YEAR(AJ7)-YEAR(G10))-AN8,0)","v":{"$error":"#VALUE!"}},{"$f":"IF(config!H28=\"ano completo\",IF(YEAR(AJ7)>YEAR(G10),(YEAR(AJ7)-YEAR(G10))-AN8,0),IF(YEAR(AK7)>YEAR(G10),(YEAR(AK7)-YEAR(G10))-AN7,0))","v":{"$error":"#VALUE!"}},{"$f":"IF(AM8<=0,DAY(AJ7)-DAY(G10),0)","v":{"$error":"#VALUE!"}},{"$f":"MONTH(AJ7)-MONTH(G10)","v":{"$error":"#VALUE!"}},{"$f":"IF(AM8<0,1,IF(AL8<0,1,0))","v":{"$error":"#VALUE!"}},"Dias além da lei 12.506",{"$f":"IF(K8=\"Dispensa sem justa causa\",IF(config!Z16=\"sim\",calculo!AJ8,0),0)","v":0}]
[null,null,null,null,null,null,null,null,null,null,null,null,null,null,null,null,null,null,null,null,null,null,null,null,null,null,null,null,null,null,null,null,null,"ano atual",{"$f":"YEAR(Z10)","v":{"$error":"#VALUE!"}},{"$f":"DATE(AI9,1,1)","v":{"$error":"#VALUE!"}}]
[null,null,null,"Admissão:",null,null,{"$f":"IF(mascara!H8=\"\",\"\",mascara!H8)","v":""},null,null,null,null,null,"Data do aviso:",null,null,null,{"$f":"mascara!H10","v":"00:00:00"},null,null,null,null,null,null,null,"Saída:",{"$f":"IF(mascara!H12=\"\",\"\",mascara!H12)","v":""},null,null,null,null,null,null,null,"Meses trabalhados no ano",{"$f":"MONTH(AI7)+AK10","v":{"$error":"#VALUE!"}},{"$f":"DAY(AI7)","v":{"$error":"#VALUE!"}},{"$f":"IF(AJ10<15,-1,0)","v":{"$error":"#VALUE!"}}]
{"$rows_left_out":52}
{"sheet":"seg aut","index":4,"n_rows":57,"n_cols":15,"rows_kept":57,"cut":false,"hidden":false,"merged":[[4,1,4,7],[9,2,9,7],[11,2,11,7],[14,3,14,7],[16,3,16,4],[18,3,18,4],[5,1,5,7],[20,1,20,7],[24,1,26,7],[27,1,29,7],[31,1,31,7],[32,1,32,7],[33,1,33,7],[34,1,34,7],[35,1,35,7],[36,1,36,7],[37,1,37,7],[38,1,38,7],[39,1,39,7],[40,1,40,7],[41,1,41,7],[42,1,42,7],[43,1,43,7],[44,1,44,7],[45,1,45,7],[52,1,52,7],[53,1,53,7],[54,1,54,7],[55,1,55,7],[46,1,46,7],[47,1,47,7],[48,1,48,7],[49,1,49,7],[50,1,50,7],[51,1,51,7]]}
[null,{"$f":"config!I101","v":"FECOMERCIÁRIOS"},null,null,null,null,null,null,null,"Único Company    .:.    Acácio Jr     .:.    Fecomerciários"]
[null,{"$f":"config!I102","v":"Federação dos Empregados no Comércio do Estado de São Paulo"}]
[]
[]
[null,"Cálculo de seguro desemprego",null,null,null,null,null,null,null,null,"data de saída para calculo",{"$f":"F11","v":""}]
[null,{"$f":"IF(mascara!H6=\"Pedido de demissão\",\"Pedido de demissão não dá direito a seguro desemprego\",\"\")","v":""},null,null,null,null,null,null,null,null,"meses",{"$f":"IF(N6<15,M6,M6+1)","v":{"$error":"#VALUE!"}},{"$f":"(YEAR(F11)-YEAR(F9))*12+MONTH(F11)-MONTH(F9)","v":{"$error":"#VALUE!"}},{"$f":"IF(DAY(F11)>DAY(F9),DAY(F11)-DAY(F9)+1,DAY(F9)-DAY(F11)+1)","v":{"$error":"#VALUE!"}}]
[null,null,null,null,"Salário:",{"$f":"mascara!H14","v":0},null,null,null,null,"Salário mínimo",{"$f":"config!K95","v":880}]
[]
[null,null,null,null,"Data de admissão:",{"$f":"mascara!H8","v":"00:00:00"},null,null,null,"Faixas de salário",null,"cálculo",null,null,"resultado"]
[null,null,null,null,null,null,null,null,null,"até",{"$f":"config!F82","v":1360.7},{"$f":"config!T82","v":0.8},null,null,{"$f":"IF(F7<=K10,F7*L10,0)","v":0}]
{"$rows_left_out":48}
{"sheet":"masc_termino","index":5,"n_rows":24,"n_cols":19,"rows_kept":24,"cut":false,"hidden":false,"merged":[[23,0,23,19],[12,0,12,19],[9,9,9,10],[9,11,9,13],[10,0,10,19],[14,0,14,19],[22,4,22,8],[18,0,18,19],[19,1,19,7],[19,8,19,9],[15,1,15,18],[16,1,16,18],[17,1,17,9],[17,10,17,11],[11,1,11,10],[13,8,13,10],[17,15,17,17],[13,11,13,16],[0,13,1,18],[2,13,2,18],[4,0,4,19],[6,0,6,19],[5,1,5,18],[7,8,7,10],[7,11,7,13],[8,0,8,19]]}
[null,null,null,null,null,null,null,null,null,null,null,null,null,"Base de cálculo demissional"]
[]
[null,null,null,null,null,null,null,null,null,null,null,null,null,{"$f":"config!I101","v":"FECOMERCIÁRIOS"}]
[]
[]
[null,"Término de Contrato de Experiência - Rescisão"]
[]
[null,null,null,null,null,null,null,null,"Admissão:",null,null,null,null,null,"dd/mm/aaaa (data do registro na carteira)"]
[]
[null,null,null,null,null,null,null,null,null,"Saída:",null,null,null,null,"dd/mm/aaaa (data do último dia trabalhado na empresa)"]
{"$rows_left_out":15}
{"sheet":"termin_exp","index":6,"n_rows":47,"n_cols":37,"rows_kept":47,"cut":false,"hidden":false,"merged":[[2,6,2,26],[4,1,4,26],[5,1,5,26],[9,4,9,8],[9,12,9,15],[10,18,10,26],[9,20,9,25],[13,12,13,13],[13,15,13,24],[13,25,13,26],[17,5,17,6],[17,8,17,11],[17,17,17,26],[43,30,44,30],[25,8,25,11],[25,23,25,26],[31,7,31,11],[29,23,29,26],[43,29,44,29],[35,13,35,16],[27,23,27,26],[47,1,48,15],[7,1,7,26],[37,8,37,11],[33,13,33,16],[38,1,40,26],[19,4,19,5],[19,8,19,11],[19,12,19,13],[19,23,19,26],[13,1,13,11],[21,8,21,11],[21,23,21,26],[23,8,23,11],[23,23,23,26],[31,17,31,21],[31,22,31,26]]}
[null,{"$f":"config!I101","v":"FECOMERCIÁRIOS"},null,null,null,null,null,null,null,null,null,null,null,null,null,null,null,null,null,null,null,null,null,null,null,null,null,null,"Único Company    .:.    Acácio Jr     .:.    Fecomerciários"]
[null,{"$f":"config!I102","v":"Federação dos Empregados no Comércio do Estado de São Paulo"},null,null,null,null,null,null,null,null,null,null,null,null,null,null,null,null,null,null,null,null,null,null,null,null,null,null,null,null,"dias","meses"]
[null,null,null,null,null,null,null,null,null,null,null,null,null,null,null,null,null,null,null,null,null,null,null,null,null,null,null,null,null,"Meses trabalhados",{"$f":"(M10-E10)+1","v":1},{"$f":"IF(AE3>=15,IF(AE3<=44,1,IF(AE3<=74,2,IF(AE3<=104,3,IF(AE3<=119,4)))))","v":false}]
[null,{"$f":"config!J103","v":"Rua dos Pinheiros, nº 20 - Pinheiros"},null,null,null,null,null,null,null,null,null,null,null,null,null,null,null,null,null,null,null,null,null,null,null,null,{"$f":"config!H104","v":"(11) 3060 6600"}]
[]
[null,"Base de Calculo - Rescisão de Contrato de Experiência",null,null,null,null,null,null,null,null,null,null,null,null,null,null,null,null,null,null,null,null,null,null,null,null,null,null,null,"saldo de dias trabalhados",{"$f":"IF(MONTH(M10)=MONTH(E10),IF(YEAR(M10)=YEAR(E10),DAY(M10)-DAY(E10),DAY(M10)),DAY(M10))","v":0},"Total de dias trabalhados no mes",{"$f":"IF(MONTH(M10)=MONTH(E10),IF(YEAR(M10)=YEAR(E10),DAY(M10)-DAY(E10),DAY(M10)),DAY(M10))","v":0}]
[null,null,null,null,null,null,null,null,null,null,null,null,null,null,null,null,null,null,null,null,null,null,null,null,null,null,null,null,null,"Data saída  aviso",null,{"$f":"M10","v":"00:00:00"},"dia",null,"Dias para 13º","meses 13º"]
[null,"Término de Contrado de Experiência",null,null,null,null,null,null,null,null,null,null,null,null,null,null,null,null,null,null,null,null,null,null,null,null,null,null,null,"Anos trabalhados",{"$f":"IF(YEAR(AF7)>YEAR(E10),(YEAR(AF7)-YEAR(E10))-AH8,0)","v":0},{"$f":"IF(AG8<=0,DAY(AF7)-DAY(E10),0)","v":0},{"$f":"MONTH(AF7)-MONTH(E10)","v":0},{"$f":"IF(AG8<0,1,IF(AF8<0,1,0))","v":0},{"$f":"DAY(AF7)-DAY(E10)","v":0},{"$f":"IF(AI8>=15,AG8+1,AG8)","v":0}]
[null,null,null,null,null,null,null,null,null,null,null,null,null,null,null,null,null,null,null,null,null,null,null,null,null,null,null,null,null,"ano atual",{"$f":"YEAR(M10)","v":1900},{"$f":"DATE(AE9,1,1)","v":"1900-01-01"}]
[null,"Admissão:",null,null,{"$f":"masc_termino!L8","v":"00:00:00"},null,null,null,null,null,"Saída:",null,{"$f":"masc_termino!L10","v":"00:00:00"},null,null,null,null,"Salário:",null,null,{"$f":"masc_termino!L14","v":0},null,null,null,null,null,null,null,null,"Meses trabalhados no ano",{"$f":"MONTH(AF7)+AG10","v":0},{"$f":"DAY(AF7)","v":0},{"$f":"IF(AF10<15,-1,0)","v":-1}]
{"$rows_left_out":38}
{"sheet":"masc_exp2","index":7,"n_rows":24,"n_cols":23,"rows_kept":24,"cut":false,"hidden":false,"merged":[[23,0,23,19],[9,11,9,13],[10,0,10,19],[15,1,15,18],[16,1,16,18],[22,4,22,8],[11,1,11,10],[11,11,11,12],[13,8,13,10],[17,1,17,9],[19,1,19,7],[17,10,17,11],[12,0,12,19],[13,11,13,16],[14,0,14,19],[18,0,18,19],[19,8,19,9],[8,0,8,19],[9,9,9,10],[0,13,1,18],[2,13,2,18],[4,0,4,19],[6,0,6,19],[7,8,7,10],[7,11,7,13],[5,1,5,11],[5,12,5,18],[17,17,17,18]]}
[null,null,null,null,null,null,null,null,null,null,null,null,null,"Base de cálculo demissional"]
[null,null,null,null,null,null,null,null,null,null,null,null,null,null,null,null,null,null,null,null,null,null,"por parte da empresa"]
[null,null,null,null,null,null,null,null,null,null,null,null,null,{"$f":"config!I101","v":"FECOMERCIÁRIOS"},null,null,null,null,null,null,null,null,"por parte do trabalhador"]
[]
[]
[null,"Rescisão antecipada do contrato de experiência:"]
[]
[null,null,null,null,null,null,null,null,"Admissão:",null,null,null,null,null,"dd/mm/aaaa (data do registro na carteira)"]
[]
[null,null,null,null,null,null,null,null,null,"Saída:",null,null,null,null,"dd/mm/aaaa (data do último dia trabalhado na empresa)"]
{"$rows_left_out":15}
{"sheet":"exp2","index":8,"n_rows":47,"n_cols":37,"rows_kept":47,"cut":false,"hidden":false,"merged":[[9,23,9,26],[25,8,25,11],[27,23,27,26],[21,23,21,26],[33,22,33,26],[27,8,27,11],[33,7,33,11],[33,17,33,21],[23,8,23,11],[29,23,29,26],[10,18,10,26],[11,4,11,9],[13,1,13,11],[13,12,13,13],[13,15,13,24],[19,23,19,26],[19,12,19,13],[43,30,44,30],[35,18,35,21],[39,1,41,26],[35,8,35,11],[37,8,37,11],[43,29,44,29],[37,18,37,21],[31,23,31,26],[13,25,13,26],[25,23,25,26],[17,8,17,11],[7,14,7,20],[2,6,2,26],[4,1,4,26],[5,1,5,26],[9,4,9,8],[9,12,9,15],[9,17,9,22],[17,5,17,6],[19,4,19,5],[19,8,19,11],[23,23,23,26],[21,8,21,11],[17,17,17,26]]}
[null,{"$f":"config!I101","v":"FECOMERCIÁRIOS"}]
[null,{"$f":"config!I102","v":"Federação dos Empregados no Comércio do Estado de São Paulo"},null,null,null,null,null,null,null,null,null,null,null,null,null,null,null,null,null,null,null,null,null,null,null,null,null,null,null,null,"dias","meses"]
[null,null,null,null,null,null,null,null,null,null,null,null,null,null,null,null,null,null,null,null,null,null,null,null,null,null,null,null,null,"Meses trabalhados",{"$f":"(M10-E10)+1","v":1},{"$f":"IF(AE3>=15,IF(AE3<=44,1,IF(AE3<=74,2,IF(AE3<=104,3,IF(AE3<=119,4)))))","v":false}]
[null,{"$f":"config!J103","v":"Rua dos Pinheiros, nº 20 - Pinheiros"},null,null,null,null,null,null,null,null,null,null,null,null,null,null,null,null,null,null,null,null,null,null,null,null,{"$f":"config!H104","v":"(11) 3060 6600"}]
[null,null,null,null,null,null,null,null,null,null,null,null,null,null,null,null,null,null,null,null,null,null,null,null,null,null,null,null,null,"Dias de multa para termino contrato",{"$f":"(X10-M10)/2","v":-0.5}]
[null,"Base de Calculo - Rescisão de Contrato de Experiência",null,null,null,null,null,null,null,null,null,null,null,null,null,null,null,null,null,null,null,null,null,null,null,null,null,null,null,"saldo de dias trabalhados",{"$f":"IF(MONTH(M10)=MONTH(E10),IF(YEAR(M10)=YEAR(E10),DAY(M10)-DAY(E10),DAY(M10)),DAY(M10))","v":0},"Saldo de dias trabalhados no mes",{"$f":"IF(MONTH(M10)=MONTH(E10),IF(YEAR(M10)=YEAR(E10),DAY(M10)-DAY(E10)+1,DAY(M10)),DAY(M10))","v":1}]
[null,null,null,null,null,null,null,null,null,null,null,null,null,null,null,null,null,null,null,null,null,null,null,null,null,null,null,null,null,"Data saída  aviso",null,{"$f":"IF(O8=\"Dispensa sem justa causa\",IF(X10=\"sim\",M10,IF(X10=\"não\",(M10+30))),M10)","v":"00:00:00"},"dia",null,"Dias para 13º","meses 13º"]
[null,"Rescisão antecipada do contrato de experiência:",null,null,null,null,null,null,null,null,null,null,null,null,{"$f":"masc_exp2!M6","v":0},null,null,null,null,null,null,null,null,null,null,null,null,null,null,"Anos trabalhados",{"$f":"IF(YEAR(AF7)>YEAR(E10),(YEAR(AF7)-YEAR(E10))-AH8,0)","v":0},{"$f":"IF(AG8<=0,DAY(AF7)-DAY(E10),0)","v":0},{"$f":"MONTH(AF7)-MONTH(E10)","v":0},{"$f":"IF(AG8<0,1,IF(AF8<0,1,0))","v":0},{"$f":"DAY(AF7)-DAY(E10)","v":0},{"$f":"IF(AI8>=15,AG8+1,AG8)","v":0}]
[null,null,null,null,null,null,null,null,null,null,null,null,null,null,null,null,null,null,null,null,null,null,null,null,null,null,null,null,null,"ano atual",{"$f":"YEAR(M10)","v":1900},{"$f":"DATE(AE9,1,1)","v":"1900-01-01"}]
[null,"Admissão:",null,null,{"$f":"masc_exp2!L8","v":"00:00:00"},null,null,null,null,null,"Saída:",null,{"$f":"masc_exp2!L10","v":"00:00:00"},null,null,null,null,"Término do contrato:",null,null,null,null,null,{"$f":"(masc_exp2!L8+masc_exp2!L12)-1","v":-1},null,null,null,null,null,"Meses trabalhados no ano",{"$f":"MONTH(AF7)+AG10","v":0},{"$f":"DAY(AF7)","v":0},{"$f":"IF(AF10<15,-1,0)","v":-1}]
{"$rows_left_out":38}
{"sheet":"config","index":9,"n_rows":115,"n_cols":39,"rows_kept":115,"cut":false,"hidden":false,"merged":[[101,27,101,28],[101,29,101,30],[102,27,102,28],[102,29,102,30],[99,27,99,31],[7,15,7,17],[5,15,5,17],[15,25,15,26],[99,4,99,8],[82,30,82,32],[79,4,79,15],[59,15,59,17],[65,10,65,12],[81,19,81,20],[81,21,81,22],[82,16,82,18],[71,5,71,7],[72,5,72,7],[73,5,73,7],[71,12,71,13],[75,14,75,15],[61,15,61,17],[62,15,62,17],[44,8,44,11],[108,4,108,10],[14,4,15,24],[82,25,82,26],[60,12,60,13],[61,12,61,13],[62,12,62,13],[63,12,63,13],[61,9,61,11],[62,9,62,11],[19,25,19,26],[20,25,20,26],[18,20,18,24],[63,15,63,17],[21,25,21,26],[59,12,59,13],[72,12,72,13],[73,12,73,13],[82,23,82,24],[60,15,60,17],[19,20,19,24],[83,18,83,20],[94,10,94,12],[69,4,69,10],[57,4,57,10],[109,4,109,27],[17,20,17,21],[18,25,18,26],[100,8,100,18],[101,8,101,23],[102,9,102,23],[103,7,103,12],[103,15,103,23],[104,6,104,15],[89,5,89,7],[90,5,90,7],[89,8,89,10],[90,8,90,10],[94,15,94,16],[87,4,87,9],[18,4,21,18],[20,19,20,24],[21,19,21,24],[45,4,45,7],[46,4,46,7],[47,4,47,7],[48,4,48,7],[49,4,49,7],[40,4,40,7],[0,4,0,7],[81,5,81,7],[82,5,82,7],[83,6,83,8],[82,9,82,11],[59,9,59,11],[60,9,60,11],[72,9,72,11],[73,9,73,11],[59,5,59,7],[63,7,63,9],[60,5,60,7],[61,5,61,7],[62,5,62,7],[4,3,4,15],[10,3,10,15],[50,4,50,7],[51,4,51,7],[34,8,34,11],[29,8,29,11],[25,4,25,11],[51,8,51,11],[29,4,29,7],[9,15,9,17],[45,8,45,11],[46,8,46,11],[47,8,47,11],[35,8,35,11],[36,8,36,11],[31,4,31,7],[32,4,32,7],[33,4,33,7],[34,4,34,7],[35,4,35,7],[36,4,36,7],[37,4,37,7],[48,8,48,11],[30,4,30,7],[44,4,44,7],[38,4,38,7],[39,4,39,7],[43,8,43,11],[52,11,52,12],[27,4,27,6],[27,7,27,11],[49,8,49,11],[40,8,40,11],[41,8,41,11],[42,8,42,11],[30,8,30,11],[31,8,31,11],[32,8,32,11],[33,8,33,11],[50,8,50,11],[37,8,37,11],[38,8,38,11],[39,8,39,11],[41,4,41,7],[42,4,42,7],[43,4,43,7]]}
[null,null,null,null,"Configuração"]
[]
[null,null,null,null,"Configuração para cálculos rescisórios"]
[]
[]
[null,null,null,null,"Contribuição Confederativa/Assistencial:",null,null,null,null,null,null,null,null,null,null,0.01]
[]
[null,null,null,null,"Calcula sobre outros (valores adicionais do mês)?",null,null,null,null,null,null,null,null,null,null,"Sim"]
[]
[null,null,null,null,"Valor limite de desconto:"]
{"$rows_left_out":105}